Information card for entry 7117822
Common name | tris(dimethylsilylmethyl)triethylbenzene |
Formula | C21 H42 Si3 |
Calculated formula | C21 H42 Si3 |
SMILES | c1(c(c(c(c(c1CC)C[SiH](C)C)CC)C[SiH](C)C)CC)C[SiH](C)C |
Title of publication | A hydrogen bonded molecular capsule versus a 3D network of tripodal organopolysilanols |
Authors of publication | Marina Fukawa; Takayuki Sato; Yoshio Kabe |
Journal of publication | Chem.Commun. |
Year of publication | 2015 |
Journal volume | 51 |
Pages of publication | 14746 |
a | 8.5296 ± 0.0013 Å |
b | 22.691 ± 0.003 Å |
c | 13.414 ± 0.002 Å |
α | 90° |
β | 105.992 ± 0.002° |
γ | 90° |
Cell volume | 2495.7 ± 0.6 Å3 |
Cell temperature | 120 ± 2 K |
Ambient diffraction temperature | 120 ± 2 K |
Number of distinct elements | 3 |
Space group number | 14 |
Hermann-Mauguin space group symbol | P 1 21/n 1 |
Hall space group symbol | -P 2yn |
Residual factor for all reflections | 0.0601 |
Residual factor for significantly intense reflections | 0.0523 |
Weighted residual factors for significantly intense reflections | 0.1258 |
Weighted residual factors for all reflections included in the refinement | 0.1325 |
Goodness-of-fit parameter for all reflections included in the refinement | 1.063 |
Diffraction radiation wavelength | 0.71073 Å |
Diffraction radiation type | MoKα |