Information card for entry 7119776
Formula |
C32 H45 N O5 S |
Calculated formula |
C32 H45 N O5 S |
Title of publication |
Synthesis, characterization, and radioprotective activity of α, β-unsaturated aryl sulfones analogs and their Tempol conjugates |
Authors of publication |
Zhou, Nan; Feng, Tian; Shen, Xin; Cui, Jiahui; Wu, Rangxin; Wang, Libin; Wang, Siwang; Zhang, Shengyong; Chen, Hui |
Journal of publication |
Med. Chem. Commun. |
Year of publication |
2017 |
a |
5.9676 ± 0.0016 Å |
b |
16.491 ± 0.004 Å |
c |
16.558 ± 0.005 Å |
α |
97.004 ± 0.004° |
β |
93.026 ± 0.004° |
γ |
92.51 ± 0.003° |
Cell volume |
1613 ± 0.8 Å3 |
Cell temperature |
296 ± 2 K |
Ambient diffraction temperature |
296 ± 2 K |
Number of distinct elements |
5 |
Space group number |
2 |
Hermann-Mauguin space group symbol |
P -1 |
Hall space group symbol |
-P 1 |
Residual factor for all reflections |
0.093 |
Residual factor for significantly intense reflections |
0.0508 |
Weighted residual factors for significantly intense reflections |
0.1111 |
Weighted residual factors for all reflections included in the refinement |
0.1248 |
Goodness-of-fit parameter for all reflections included in the refinement |
1.066 |
Diffraction radiation wavelength |
0.71073 Å |
Diffraction radiation type |
MoKα |
Yes |
Yes |
No |