Information card for entry 7122195
Formula | C96 H122 N2 O30 Ti6 |
Calculated formula | C96 H36 N2 O30 Ti6 |
Title of publication | Triphenylamine derived titanium oxo clusters: an approach to effective organic-inorganic hybrid dyes for photoactive electrodes. |
Authors of publication | Zou, Dan-Hong; Cui, Li-Na; Liu, Pei-Yi; Yang, Shen; Zhu, Qin-Yu; Dai, Jie |
Journal of publication | Chemical communications (Cambridge, England) |
Year of publication | 2018 |
Journal volume | 54 |
Journal issue | 71 |
Pages of publication | 9933 - 9936 |
a | 15.5612 ± 0.0011 Å |
b | 15.6396 ± 0.0011 Å |
c | 21.2233 ± 0.0015 Å |
α | 90° |
β | 95.892 ± 0.004° |
γ | 90° |
Cell volume | 5137.8 ± 0.6 Å3 |
Cell temperature | 120 ± 2 K |
Ambient diffraction temperature | 120 ± 2 K |
Number of distinct elements | 5 |
Space group number | 14 |
Hermann-Mauguin space group symbol | P 1 21/c 1 |
Hall space group symbol | -P 2ybc |
Residual factor for all reflections | 0.1364 |
Residual factor for significantly intense reflections | 0.0732 |
Weighted residual factors for significantly intense reflections | 0.143 |
Weighted residual factors for all reflections included in the refinement | 0.1663 |
Goodness-of-fit parameter for all reflections included in the refinement | 1.035 |
Diffraction radiation wavelength | 0.71073 Å |
Diffraction radiation type | MoKα |