Information card for entry 7122604
Formula | C14 H18 Mo9 N2 O28 |
Calculated formula | C14 H18 Mo9 N2 O28 |
Title of publication | Significant enhancement of conductance of a hybrid layered molybdate semiconductor by light or heat. |
Authors of publication | Wei, Yong-Qin; Sun, Cai; Chen, Qing-Song; Wang, Ming-Sheng; Guo, Guo-Cong |
Journal of publication | Chemical communications (Cambridge, England) |
Year of publication | 2018 |
Journal volume | 54 |
Journal issue | 100 |
Pages of publication | 14077 - 14080 |
a | 27.187 ± 0.006 Å |
b | 5.4936 ± 0.0009 Å |
c | 24.825 ± 0.006 Å |
α | 90° |
β | 121.511 ± 0.004° |
γ | 90° |
Cell volume | 3161 ± 1.2 Å3 |
Cell temperature | 293 ± 2 K |
Ambient diffraction temperature | 293 ± 2 K |
Number of distinct elements | 5 |
Space group number | 15 |
Hermann-Mauguin space group symbol | C 1 2/c 1 |
Hall space group symbol | -C 2yc |
Residual factor for all reflections | 0.0562 |
Residual factor for significantly intense reflections | 0.0407 |
Weighted residual factors for significantly intense reflections | 0.11 |
Weighted residual factors for all reflections included in the refinement | 0.123 |
Goodness-of-fit parameter for all reflections included in the refinement | 0.966 |
Diffraction radiation wavelength | 0.71073 Å |
Diffraction radiation type | MoKα |