Information card for entry 7127885
Formula | C10 H18 B2 N2 O |
Calculated formula | C10 H18 B2 N2 O |
Title of publication | Dialkynyldiboranes(4) and the selectable reactivity of their C-H, C[triple bond, length as m-dash]C and B-B bonds. |
Authors of publication | Schorr, Fabian; Fantuzzi, Felipe; Dewhurst, Rian D.; Braunschweig, Holger |
Journal of publication | Chemical communications (Cambridge, England) |
Year of publication | 2021 |
Journal volume | 57 |
Journal issue | 21 |
Pages of publication | 2645 - 2648 |
a | 18.1518 ± 0.0012 Å |
b | 6.7454 ± 0.0004 Å |
c | 12.0546 ± 0.0008 Å |
α | 90° |
β | 124.587 ± 0.002° |
γ | 90° |
Cell volume | 1215.12 ± 0.14 Å3 |
Cell temperature | 100 ± 2 K |
Ambient diffraction temperature | 100 ± 2 K |
Number of distinct elements | 5 |
Space group number | 15 |
Hermann-Mauguin space group symbol | C 1 2/c 1 |
Hall space group symbol | -C 2yc |
Residual factor for all reflections | 0.0476 |
Residual factor for significantly intense reflections | 0.0431 |
Weighted residual factors for significantly intense reflections | 0.1202 |
Weighted residual factors for all reflections included in the refinement | 0.1241 |
Goodness-of-fit parameter for all reflections included in the refinement | 1.116 |
Diffraction radiation wavelength | 0.71073 Å |
Diffraction radiation type | MoKα |