Information card for entry 7127888
Formula | C110 H134 B8 Co16 N8 O48 Si8 |
Calculated formula | C110 H134 B8 Co16 N8 O48 Si8 |
Title of publication | Dialkynyldiboranes(4) and the selectable reactivity of their C-H, C[triple bond, length as m-dash]C and B-B bonds. |
Authors of publication | Schorr, Fabian; Fantuzzi, Felipe; Dewhurst, Rian D.; Braunschweig, Holger |
Journal of publication | Chemical communications (Cambridge, England) |
Year of publication | 2021 |
Journal volume | 57 |
Journal issue | 21 |
Pages of publication | 2645 - 2648 |
a | 20.8512 ± 0.0003 Å |
b | 21.3528 ± 0.0003 Å |
c | 18.4332 ± 0.0003 Å |
α | 90° |
β | 90° |
γ | 90° |
Cell volume | 8207 ± 0.2 Å3 |
Cell temperature | 100 ± 2 K |
Ambient diffraction temperature | 100 ± 2 K |
Number of distinct elements | 7 |
Space group number | 60 |
Hermann-Mauguin space group symbol | P b c n |
Hall space group symbol | -P 2n 2ab |
Residual factor for all reflections | 0.0634 |
Residual factor for significantly intense reflections | 0.0575 |
Weighted residual factors for significantly intense reflections | 0.1396 |
Weighted residual factors for all reflections included in the refinement | 0.1417 |
Goodness-of-fit parameter for all reflections included in the refinement | 1.349 |
Diffraction radiation wavelength | 0.71073 Å |
Diffraction radiation type | MoKα |