Information card for entry 7132422
Formula | C26 H24 N2 O2 |
Calculated formula | C26 H24 N2 O2 |
Title of publication | Leveraging cascade alkynyl Prins cyclization towards the stereoselective synthesis of spiro-furan quinazolinone scaffolds. |
Authors of publication | Biswas, Subhamoy; Shit, Sudip; Behera, Bipin Kumar; Sahu, Archana Kumari; Saikia, Anil K. |
Journal of publication | Chemical communications (Cambridge, England) |
Year of publication | 2023 |
Journal volume | 59 |
Journal issue | 96 |
Pages of publication | 14301 - 14304 |
a | 12.1441 ± 0.0013 Å |
b | 10.4866 ± 0.0011 Å |
c | 21.897 ± 0.002 Å |
α | 90° |
β | 97.791 ± 0.003° |
γ | 90° |
Cell volume | 2762.8 ± 0.5 Å3 |
Cell temperature | 298 ± 2 K |
Ambient diffraction temperature | 298 K |
Number of distinct elements | 4 |
Space group number | 14 |
Hermann-Mauguin space group symbol | P 1 21/n 1 |
Hall space group symbol | -P 2yn |
Residual factor for all reflections | 0.0675 |
Residual factor for significantly intense reflections | 0.0528 |
Weighted residual factors for significantly intense reflections | 0.152 |
Weighted residual factors for all reflections included in the refinement | 0.1771 |
Goodness-of-fit parameter for all reflections included in the refinement | 1.061 |
Diffraction radiation wavelength | 0.71073 Å |
Diffraction radiation type | MoKα |