Information card for entry 7132815
Formula | C15 H20 Cl N O |
Calculated formula | C15 H20 Cl N O |
SMILES | ClN(C(=O)C1CCC1)c1c(cccc1)C(C)(C)C |
Title of publication | Synthesis, structure and stereodynamics of atropisomeric <i>N</i>-chloroamides. |
Authors of publication | Campbell, Aaron D. G.; Roper, Natalie J.; Waddell, Paul G.; Wills, Corinne; Dixon, Casey M.; Denton, Ross M.; Ermanis, Kristaps; Armstrong, Roly J. |
Journal of publication | Chemical communications (Cambridge, England) |
Year of publication | 2024 |
Journal volume | 60 |
Journal issue | 28 |
Pages of publication | 3818 - 3821 |
a | 17.0047 ± 0.0005 Å |
b | 6.656 ± 0.0002 Å |
c | 24.757 ± 0.0008 Å |
α | 90° |
β | 92.075 ± 0.003° |
γ | 90° |
Cell volume | 2800.24 ± 0.15 Å3 |
Cell temperature | 150 ± 0.2 K |
Ambient diffraction temperature | 150 ± 0.2 K |
Number of distinct elements | 5 |
Space group number | 15 |
Hermann-Mauguin space group symbol | C 1 2/c 1 |
Hall space group symbol | -C 2yc |
Residual factor for all reflections | 0.0372 |
Residual factor for significantly intense reflections | 0.033 |
Weighted residual factors for significantly intense reflections | 0.0886 |
Weighted residual factors for all reflections included in the refinement | 0.0928 |
Goodness-of-fit parameter for all reflections included in the refinement | 1.066 |
Diffraction radiation probe | x-ray |
Diffraction radiation wavelength | 1.54184 Å |
Diffraction radiation type | CuKα |