Information card for entry 7132817
Formula | C17 H18 Cl N O |
Calculated formula | C17 H18 Cl N O |
SMILES | ClN(C(=O)c1ccccc1)c1c(cccc1)C(C)(C)C |
Title of publication | Synthesis, structure and stereodynamics of atropisomeric <i>N</i>-chloroamides. |
Authors of publication | Campbell, Aaron D. G.; Roper, Natalie J.; Waddell, Paul G.; Wills, Corinne; Dixon, Casey M.; Denton, Ross M.; Ermanis, Kristaps; Armstrong, Roly J. |
Journal of publication | Chemical communications (Cambridge, England) |
Year of publication | 2024 |
Journal volume | 60 |
Journal issue | 28 |
Pages of publication | 3818 - 3821 |
a | 7.6345 ± 0.0001 Å |
b | 9.6295 ± 0.0001 Å |
c | 20.4737 ± 0.0002 Å |
α | 90° |
β | 90° |
γ | 90° |
Cell volume | 1505.15 ± 0.03 Å3 |
Cell temperature | 150 ± 0.2 K |
Ambient diffraction temperature | 150 ± 0.2 K |
Number of distinct elements | 5 |
Space group number | 19 |
Hermann-Mauguin space group symbol | P 21 21 21 |
Hall space group symbol | P 2ac 2ab |
Residual factor for all reflections | 0.0259 |
Residual factor for significantly intense reflections | 0.0252 |
Weighted residual factors for significantly intense reflections | 0.0649 |
Weighted residual factors for all reflections included in the refinement | 0.0654 |
Goodness-of-fit parameter for all reflections included in the refinement | 1.046 |
Diffraction radiation probe | x-ray |
Diffraction radiation wavelength | 1.54184 Å |
Diffraction radiation type | CuKα |