Information card for entry 7132931
Formula | C28 H26 N2 O2 P2 |
Calculated formula | C28 H26 N2 O2 P2 |
Title of publication | Epimerization effects on coordination behaviours of phenanthroline-based phosphine-oxide ligands with uranyl ions. |
Authors of publication | Yang, Xiaofan; Fang, Dong; Wang, Shihui; Tian, Zhenjiang; Xu, Lei; Liu, Jiyong; Zhang, Anyun; Xiao, Chengliang |
Journal of publication | Chemical communications (Cambridge, England) |
Year of publication | 2024 |
Journal volume | 60 |
Journal issue | 38 |
Pages of publication | 5042 - 5045 |
a | 10.1143 ± 0.0004 Å |
b | 28.2649 ± 0.0012 Å |
c | 8.4249 ± 0.0004 Å |
α | 90° |
β | 98.202 ± 0.002° |
γ | 90° |
Cell volume | 2383.87 ± 0.18 Å3 |
Cell temperature | 170 K |
Ambient diffraction temperature | 170 K |
Number of distinct elements | 5 |
Space group number | 14 |
Hermann-Mauguin space group symbol | P 1 21/c 1 |
Hall space group symbol | -P 2ybc |
Residual factor for all reflections | 0.0434 |
Residual factor for significantly intense reflections | 0.0387 |
Weighted residual factors for significantly intense reflections | 0.0983 |
Weighted residual factors for all reflections included in the refinement | 0.1009 |
Goodness-of-fit parameter for all reflections included in the refinement | 1.059 |
Diffraction radiation wavelength | 1.34139 Å |
Diffraction radiation type | GaKα |