Information card for entry 7132940
Formula | C84 H108 N2 Nd S2 |
Calculated formula | C84 H108 N2 Nd S2 |
Title of publication | Exploring sulfur donor atom coordination chemistry with La(II), Nd(II), and Tm(II) using a terphenylthiolate ligand. |
Authors of publication | Gilbert-Bass, Kito; Stennett, Cary R.; Grotjahn, Robin; Ziller, Joseph W.; Furche, Filipp; Evans, William J. |
Journal of publication | Chemical communications (Cambridge, England) |
Year of publication | 2024 |
Journal volume | 60 |
Journal issue | 34 |
Pages of publication | 4601 - 4604 |
a | 15.9566 ± 0.0015 Å |
b | 18.7918 ± 0.0017 Å |
c | 24.254 ± 0.002 Å |
α | 90° |
β | 90° |
γ | 90° |
Cell volume | 7272.6 ± 1.1 Å3 |
Cell temperature | 93.15 K |
Ambient diffraction temperature | 93.15 K |
Number of distinct elements | 5 |
Space group number | 60 |
Hermann-Mauguin space group symbol | P b c n |
Hall space group symbol | -P 2n 2ab |
Residual factor for all reflections | 0.0645 |
Residual factor for significantly intense reflections | 0.0397 |
Weighted residual factors for significantly intense reflections | 0.0969 |
Weighted residual factors for all reflections included in the refinement | 0.1098 |
Goodness-of-fit parameter for all reflections included in the refinement | 1.027 |
Diffraction radiation wavelength | 0.71073 Å |
Diffraction radiation type | MoKα |