Information card for entry 7133138
Formula | C62 H95 Cr Li N4 O5 |
Calculated formula | C62 H95 Cr Li N4 O5 |
Title of publication | Reduction of (pddi)Cr reveals redox noninnocence <i>via</i> C-C bond formation amidst competing electrophilicity: [(cpta)CrMe<sub><i>n</i></sub>]<sup>-</sup> (<i>n</i> = 0, 1) and [(pta)Cr]<sup/>. |
Authors of publication | D'Arpino, Alexander A; Wolczanski, Peter T.; MacMillan, Samantha N.; Cundari, Thomas R.; Krumov, Mihail R. |
Journal of publication | Chemical communications (Cambridge, England) |
Year of publication | 2024 |
Journal volume | 60 |
Journal issue | 53 |
Pages of publication | 6785 - 6788 |
a | 11.7699 ± 0.0001 Å |
b | 16.1506 ± 0.0002 Å |
c | 17.7227 ± 0.0002 Å |
α | 97.669 ± 0.001° |
β | 105.27 ± 0.001° |
γ | 108.783 ± 0.001° |
Cell volume | 2987.77 ± 0.07 Å3 |
Cell temperature | 101 ± 1 K |
Ambient diffraction temperature | 101 ± 1 K |
Number of distinct elements | 6 |
Space group number | 2 |
Hermann-Mauguin space group symbol | P -1 |
Hall space group symbol | -P 1 |
Residual factor for all reflections | 0.048 |
Residual factor for significantly intense reflections | 0.0465 |
Weighted residual factors for significantly intense reflections | 0.1275 |
Weighted residual factors for all reflections included in the refinement | 0.1288 |
Goodness-of-fit parameter for all reflections included in the refinement | 1.062 |
Diffraction radiation probe | x-ray |
Diffraction radiation wavelength | 1.54184 Å |
Diffraction radiation type | CuKα |