Information card for entry 7133247
Formula | C144 H135 N9 O27 |
Calculated formula | C144 H135 N9 O27 |
Title of publication | Porous organic crystals crosslinked by free-radical reactions. |
Authors of publication | Samanta, Krishanu; Mi, Jiashan; Chen, Albert D.; Li, Fangzhou; Staples, Richard J.; Rossini, Aaron J.; Ke, Chenfeng |
Journal of publication | Chemical communications (Cambridge, England) |
Year of publication | 2024 |
Journal volume | 60 |
Journal issue | 57 |
Pages of publication | 7311 - 7314 |
a | 38.116 ± 0.0009 Å |
b | 21.9306 ± 0.0004 Å |
c | 42.5599 ± 0.0012 Å |
α | 90° |
β | 103.44 ± 0.002° |
γ | 90° |
Cell volume | 34601.8 ± 1.4 Å3 |
Cell temperature | 100 ± 0.1 K |
Ambient diffraction temperature | 100 ± 0.1 K |
Number of distinct elements | 4 |
Space group number | 15 |
Hermann-Mauguin space group symbol | C 1 2/c 1 |
Hall space group symbol | -C 2yc |
Residual factor for all reflections | 0.1106 |
Residual factor for significantly intense reflections | 0.0996 |
Weighted residual factors for significantly intense reflections | 0.2932 |
Weighted residual factors for all reflections included in the refinement | 0.3023 |
Goodness-of-fit parameter for all reflections included in the refinement | 1.041 |
Diffraction radiation probe | x-ray |
Diffraction radiation wavelength | 1.54184 Å |
Diffraction radiation type | CuKα |