Information card for entry 7133279
Formula | C50 H90 Be Cl N2 Na O10 Si2 |
Calculated formula | C50 H90 Be Cl N2 Na O10 Si2 |
Title of publication | Alkali metal reduction of crown ether encapsulated alkali metal cations. |
Authors of publication | Pearce, Kyle G.; Neale, Samuel E.; Mahon, Mary F.; McMullin, Claire L.; Hill, Michael S. |
Journal of publication | Chemical communications (Cambridge, England) |
Year of publication | 2024 |
Journal volume | 60 |
Journal issue | 64 |
Pages of publication | 8391 - 8394 |
a | 15.1421 ± 0.0006 Å |
b | 20.7692 ± 0.0007 Å |
c | 18.2654 ± 0.0005 Å |
α | 90° |
β | 91.531 ± 0.003° |
γ | 90° |
Cell volume | 5742.2 ± 0.3 Å3 |
Cell temperature | 150.01 ± 0.1 K |
Ambient diffraction temperature | 150.01 ± 0.1 K |
Number of distinct elements | 8 |
Space group number | 14 |
Hermann-Mauguin space group symbol | P 1 21/c 1 |
Hall space group symbol | -P 2ybc |
Residual factor for all reflections | 0.1338 |
Residual factor for significantly intense reflections | 0.0862 |
Weighted residual factors for significantly intense reflections | 0.2314 |
Weighted residual factors for all reflections included in the refinement | 0.2734 |
Goodness-of-fit parameter for all reflections included in the refinement | 1.027 |
Diffraction radiation probe | x-ray |
Diffraction radiation wavelength | 1.54184 Å |
Diffraction radiation type | CuKα |