Information card for entry 7133306
Formula | C84 H107 Cl4 F N4 P8 |
Calculated formula | C84 H107 Cl4 F N4 P8 |
Title of publication | A neutral diphosphene radical: synthesis, electronic structure and white phosphorus activation. |
Authors of publication | Haberstroh, Jan; Taube, Clemens; Fidelius, Jannis; Schulz, Stephen; Israel, Noel; Dmitrieva, Evgenia; Gomila, Rosa M.; Frontera, Antonio; Wolf, Robert; Schwedtmann, Kai; Weigand, Jan J. |
Journal of publication | Chemical communications (Cambridge, England) |
Year of publication | 2024 |
Journal volume | 60 |
Journal issue | 65 |
Pages of publication | 8537 - 8540 |
a | 22.3963 ± 0.0001 Å |
b | 24.8472 ± 0.0001 Å |
c | 15.6004 ± 0.0001 Å |
α | 90° |
β | 96.933 ± 0.001° |
γ | 90° |
Cell volume | 8617.92 ± 0.08 Å3 |
Cell temperature | 100 ± 0.1 K |
Ambient diffraction temperature | 100 ± 0.1 K |
Number of distinct elements | 6 |
Space group number | 14 |
Hermann-Mauguin space group symbol | P 1 21/c 1 |
Hall space group symbol | -P 2ybc |
Residual factor for all reflections | 0.0542 |
Residual factor for significantly intense reflections | 0.0474 |
Weighted residual factors for significantly intense reflections | 0.1241 |
Weighted residual factors for all reflections included in the refinement | 0.129 |
Goodness-of-fit parameter for all reflections included in the refinement | 1.022 |
Diffraction radiation probe | x-ray |
Diffraction radiation wavelength | 1.54184 Å |
Diffraction radiation type | CuKα |