Information card for entry 7133337
Formula | C37 H28 N4 O2 |
Calculated formula | C37 H28 N4 O2 |
Title of publication | One flask cascade approach to a complex pyrano[2,3-<i>c</i>]pyrazole-pyrazolone hybrid heterocyclic system and its initiatory neurobiological profiling. |
Authors of publication | Balasubramani, Alagesan; Sudarshana, K. A.; Kushwaha, Roli; Chakravarty, Sumana; Pabbaraja, Srihari; Mehta, Goverdhan |
Journal of publication | Chemical communications (Cambridge, England) |
Year of publication | 2024 |
Journal volume | 60 |
Journal issue | 64 |
Pages of publication | 8443 - 8446 |
a | 9.5486 ± 0.0018 Å |
b | 9.8277 ± 0.0019 Å |
c | 16.757 ± 0.003 Å |
α | 103.234 ± 0.006° |
β | 103.776 ± 0.005° |
γ | 97.299 ± 0.006° |
Cell volume | 1459 ± 0.5 Å3 |
Cell temperature | 294 ± 2 K |
Ambient diffraction temperature | 294 ± 2 K |
Number of distinct elements | 4 |
Space group number | 2 |
Hermann-Mauguin space group symbol | P -1 |
Hall space group symbol | -P 1 |
Residual factor for all reflections | 0.0944 |
Residual factor for significantly intense reflections | 0.0464 |
Weighted residual factors for significantly intense reflections | 0.113 |
Weighted residual factors for all reflections included in the refinement | 0.1388 |
Goodness-of-fit parameter for all reflections included in the refinement | 1.015 |
Diffraction radiation wavelength | 0.71073 Å |
Diffraction radiation type | MoKα |