Information card for entry 7133407
Formula | C15 H16 N6 Ni O4 |
Calculated formula | C15 H16 N6 Ni O4 |
Title of publication | Pressure-induced single-crystal-to-single-crystal nitrite ligand isomerisation accompanied by a piezochromic effect. |
Authors of publication | Potempa, Kinga; Paliwoda, Damian; Jarzembska, Katarzyna N.; Kamiński, Radosław; Krówczyński, Adam; Borowski, Patryk; Hanfland, Michael |
Journal of publication | Chemical communications (Cambridge, England) |
Year of publication | 2024 |
Journal volume | 60 |
Journal issue | 69 |
Pages of publication | 9194 - 9197 |
a | 13.295 ± 0.003 Å |
b | 9.5267 ± 0.0013 Å |
c | 13.169 ± 0.003 Å |
α | 90° |
β | 110.6 ± 0.02° |
γ | 90° |
Cell volume | 1561.3 ± 0.6 Å3 |
Cell temperature | 293 K |
Ambient diffraction temperature | 293 K |
Number of distinct elements | 5 |
Space group number | 9 |
Hermann-Mauguin space group symbol | C 1 c 1 |
Hall space group symbol | C -2yc |
Residual factor for all reflections | 0.0732 |
Residual factor for significantly intense reflections | 0.0619 |
Weighted residual factors for significantly intense reflections | 0.1648 |
Weighted residual factors for all reflections included in the refinement | 0.1752 |
Goodness-of-fit parameter for all reflections included in the refinement | 1.072 |
Diffraction radiation wavelength | 0.40965 Å |
Diffraction radiation type | synchrotron |