Information card for entry 7133516
Formula | C33 H54 N3 P Si |
Calculated formula | C33 H54 N3 P Si |
Title of publication | A hybrid silylene-Pd catalyst: efficient C-N cross-coupling of sterically bulky amines and chiral amines. |
Authors of publication | Kaulage, Sandeep H.; Parvin, Nasrina; Khopade, Kishor V.; Khan, Shabana |
Journal of publication | Chemical communications (Cambridge, England) |
Year of publication | 2024 |
Journal volume | 60 |
Journal issue | 73 |
Pages of publication | 9958 - 9961 |
a | 10.461 ± 0.01 Å |
b | 10.611 ± 0.01 Å |
c | 16.467 ± 0.016 Å |
α | 83.31 ± 0.03° |
β | 87.04 ± 0.03° |
γ | 67.44 ± 0.02° |
Cell volume | 1676 ± 3 Å3 |
Cell temperature | 150 ± 2 K |
Ambient diffraction temperature | 150 ± 2 K |
Number of distinct elements | 5 |
Space group number | 2 |
Hermann-Mauguin space group symbol | P -1 |
Hall space group symbol | -P 1 |
Residual factor for all reflections | 0.0694 |
Residual factor for significantly intense reflections | 0.0447 |
Weighted residual factors for significantly intense reflections | 0.0914 |
Weighted residual factors for all reflections included in the refinement | 0.0998 |
Goodness-of-fit parameter for all reflections included in the refinement | 1.032 |
Diffraction radiation wavelength | 0.71073 Å |
Diffraction radiation type | MoKα |