Information card for entry 7133605
Formula | C62 H100 N4 O2 S2 Si4 Sn2 |
Calculated formula | C62 H100 N4 O2 S2 Si4 Sn2 |
Title of publication | An isolable stannaimine and its cycloaddition/metathesis reactions with carbon dioxide. |
Authors of publication | Evans, Matthew J.; Parr, Joseph M.; Nguyen, Dat T.; Jones, Cameron |
Journal of publication | Chemical communications (Cambridge, England) |
Year of publication | 2024 |
Journal volume | 60 |
Journal issue | 75 |
Pages of publication | 10350 - 10353 |
a | 15.66 ± 0.003 Å |
b | 17.71 ± 0.004 Å |
c | 12.13 ± 0.002 Å |
α | 90° |
β | 107.76 ± 0.03° |
γ | 90° |
Cell volume | 3203.8 ± 1.2 Å3 |
Cell temperature | 100 ± 2 K |
Ambient diffraction temperature | 100 ± 2 K |
Number of distinct elements | 7 |
Space group number | 14 |
Hermann-Mauguin space group symbol | P 1 21/c 1 |
Hall space group symbol | -P 2ybc |
Residual factor for all reflections | 0.0296 |
Residual factor for significantly intense reflections | 0.0278 |
Weighted residual factors for significantly intense reflections | 0.0771 |
Weighted residual factors for all reflections included in the refinement | 0.0787 |
Goodness-of-fit parameter for all reflections included in the refinement | 1.1 |
Diffraction radiation wavelength | 0.71073 Å |
Diffraction radiation type | Synchrotron |