Information card for entry 7133610
Formula | C11 H10 Br2 N4 Zn |
Calculated formula | C11 H10 Br2 N4 Zn |
Title of publication | Redox-enabled cooperative catalysis by activating secondary alcohols using low-valent Zn complexes. |
Authors of publication | Samanta, Arup; Chaubey, Amit; Pal, Debjyoti; Majhi, Krishna; Srimani, Dipankar |
Journal of publication | Chemical communications (Cambridge, England) |
Year of publication | 2024 |
Journal volume | 60 |
Journal issue | 75 |
Pages of publication | 10398 - 10401 |
a | 7.696 ± 0.0006 Å |
b | 7.9855 ± 0.0006 Å |
c | 11.6761 ± 0.0008 Å |
α | 76.839 ± 0.002° |
β | 84.112 ± 0.002° |
γ | 81.127 ± 0.002° |
Cell volume | 688.66 ± 0.09 Å3 |
Cell temperature | 296 ± 2 K |
Ambient diffraction temperature | 296 K |
Number of distinct elements | 5 |
Space group number | 2 |
Hermann-Mauguin space group symbol | P -1 |
Hall space group symbol | -P 1 |
Residual factor for all reflections | 0.0233 |
Residual factor for significantly intense reflections | 0.0207 |
Weighted residual factors for significantly intense reflections | 0.0528 |
Weighted residual factors for all reflections included in the refinement | 0.0541 |
Goodness-of-fit parameter for all reflections included in the refinement | 1.055 |
Diffraction radiation wavelength | 0.71073 Å |
Diffraction radiation type | MoKα |