Information card for entry 7133612
Formula | C27 H23 Cl N2 O2 |
Calculated formula | C27 H23 Cl N2 O2 |
Title of publication | Pd-catalyzed sequential intramolecular annulation/intermolecular [3+2] cycloaddition of 5-allenyloxazolidine-2,4-diones with dipoles: synthesis of spiroheterocycles. |
Authors of publication | Dong, Yujie; Liu, Jun; Ning, Rongjin; Yang, Fazhou; Zhang, Cheng; Guo, Hongchao |
Journal of publication | Chemical communications (Cambridge, England) |
Year of publication | 2024 |
Journal volume | 60 |
Journal issue | 76 |
Pages of publication | 10516 - 10519 |
a | 9.8079 ± 0.0005 Å |
b | 20.5558 ± 0.0011 Å |
c | 22.6273 ± 0.0012 Å |
α | 90° |
β | 94.844 ± 0.002° |
γ | 90° |
Cell volume | 4545.6 ± 0.4 Å3 |
Cell temperature | 298.15 K |
Ambient diffraction temperature | 298.15 K |
Number of distinct elements | 5 |
Space group number | 14 |
Hermann-Mauguin space group symbol | P 1 21/n 1 |
Hall space group symbol | -P 2yn |
Residual factor for all reflections | 0.0703 |
Residual factor for significantly intense reflections | 0.0501 |
Weighted residual factors for significantly intense reflections | 0.1301 |
Weighted residual factors for all reflections included in the refinement | 0.1423 |
Goodness-of-fit parameter for all reflections included in the refinement | 1.055 |
Diffraction radiation wavelength | 0.71073 Å |
Diffraction radiation type | MoKα |