Information card for entry 7154470
Formula | C22 H22 Cl N3 O3 |
Calculated formula | C22 H22 Cl N3 O3 |
Title of publication | Synthesis of 4(3H)quinazolinimines by reaction of (E)-N-(aryl)-acetimidoyl or -benzimidoyl chloride with amines. |
Authors of publication | Quintero, Celso; Valderrama, Mauricio; Becerra, Alexandra; Daniliuc, Constantin G.; Rojas, Rene S. |
Journal of publication | Organic & biomolecular chemistry |
Year of publication | 2015 |
Journal volume | 13 |
Journal issue | 22 |
Pages of publication | 6183 - 6193 |
a | 7.7886 ± 0.0002 Å |
b | 9.935 ± 0.0003 Å |
c | 13.6151 ± 0.0004 Å |
α | 83.463 ± 0.002° |
β | 84.947 ± 0.002° |
γ | 73.188 ± 0.002° |
Cell volume | 1000.26 ± 0.05 Å3 |
Cell temperature | 100 ± 2 K |
Ambient diffraction temperature | 100 ± 2 K |
Number of distinct elements | 5 |
Space group number | 2 |
Hermann-Mauguin space group symbol | P -1 |
Hall space group symbol | -P 1 |
Residual factor for all reflections | 0.0443 |
Residual factor for significantly intense reflections | 0.0362 |
Weighted residual factors for significantly intense reflections | 0.0873 |
Weighted residual factors for all reflections included in the refinement | 0.091 |
Goodness-of-fit parameter for all reflections included in the refinement | 1.053 |
Diffraction radiation wavelength | 1.54178 Å |
Diffraction radiation type | CuKα |