Information card for entry 7154552
Chemical name | (5,7-Bis(4'-propylbiphenyl-4-yl)-2,3-dihydrothieno[3,4-b][1,4]dioxin-2-yl)methanol |
Formula | C37 H36 O3 S |
Calculated formula | C36.154 H34.308 O2.718 S |
Title of publication | Palladium-catalyzed direct C-H arylations of dioxythiophenes bearing reactive functional groups: a step-economical approach for functional π-conjugated oligoarenes. |
Authors of publication | Liu, Ching-Yuan; Chong, Hui; Lin, Hsing-An; Yamashita, Yoshiro; Zhang, Bin; Huang, Kuo-Wei; Hashizume, Daizuke; Yu, Hsiao-Hua |
Journal of publication | Organic & biomolecular chemistry |
Year of publication | 2015 |
Journal volume | 13 |
Journal issue | 31 |
Pages of publication | 8505 - 8511 |
a | 10.1192 ± 0.0002 Å |
b | 11.3017 ± 0.0002 Å |
c | 25.1913 ± 0.0005 Å |
α | 90° |
β | 97.8403 ± 0.0009° |
γ | 90° |
Cell volume | 2854.05 ± 0.09 Å3 |
Cell temperature | 90 K |
Ambient diffraction temperature | 90 K |
Number of distinct elements | 4 |
Space group number | 14 |
Hermann-Mauguin space group symbol | P 1 21/c 1 |
Hall space group symbol | -P 2ybc |
Residual factor for all reflections | 0.0874 |
Residual factor for significantly intense reflections | 0.0522 |
Weighted residual factors for significantly intense reflections | 0.1261 |
Weighted residual factors for all reflections included in the refinement | 0.1429 |
Goodness-of-fit parameter for all reflections included in the refinement | 1.036 |
Diffraction radiation wavelength | 0.71073 Å |
Diffraction radiation type | MoKα |