Information card for entry 7154649
Formula | C33 H27 B F10 N |
Calculated formula | C33 H27 B F10 N |
Title of publication | Enamine/butadienylborane cycloaddition in the frustrated Lewis pair regime. |
Authors of publication | Chen, Guo-Qiang; Türkyilmaz, Fatma; Daniliuc, Constantin G.; Bannwarth, Christoph; Grimme, Stefan; Kehr, Gerald; Erker, Gerhard |
Journal of publication | Organic & biomolecular chemistry |
Year of publication | 2015 |
Journal volume | 13 |
Journal issue | 42 |
Pages of publication | 10477 - 10486 |
a | 8.3589 ± 0.0001 Å |
b | 20.9131 ± 0.0003 Å |
c | 17.1468 ± 0.0004 Å |
α | 90° |
β | 97.582 ± 0.001° |
γ | 90° |
Cell volume | 2971.23 ± 0.09 Å3 |
Cell temperature | 223 ± 2 K |
Ambient diffraction temperature | 223 ± 2 K |
Number of distinct elements | 5 |
Space group number | 14 |
Hermann-Mauguin space group symbol | P 1 21/c 1 |
Hall space group symbol | -P 2ybc |
Residual factor for all reflections | 0.0849 |
Residual factor for significantly intense reflections | 0.0581 |
Weighted residual factors for significantly intense reflections | 0.1067 |
Weighted residual factors for all reflections included in the refinement | 0.1195 |
Goodness-of-fit parameter for all reflections included in the refinement | 1.083 |
Diffraction radiation wavelength | 0.71073 Å |
Diffraction radiation type | MoKα |