Information card for entry 7154655
Formula | C27 H24 B F10 N |
Calculated formula | C27 H24 B F10 N |
SMILES | [B](/C=C/C(=C)C)(C1C(=[N+]2CCCC2)CCCC1)(c1c(F)c(F)c(F)c(F)c1F)c1c(F)c(F)c(F)c(F)c1F |
Title of publication | Enamine/butadienylborane cycloaddition in the frustrated Lewis pair regime. |
Authors of publication | Chen, Guo-Qiang; Türkyilmaz, Fatma; Daniliuc, Constantin G.; Bannwarth, Christoph; Grimme, Stefan; Kehr, Gerald; Erker, Gerhard |
Journal of publication | Organic & biomolecular chemistry |
Year of publication | 2015 |
Journal volume | 13 |
Journal issue | 42 |
Pages of publication | 10477 - 10486 |
a | 8.0677 ± 0.0003 Å |
b | 9.7095 ± 0.0004 Å |
c | 18.3172 ± 0.0007 Å |
α | 81.567 ± 0.002° |
β | 85.147 ± 0.001° |
γ | 70.608 ± 0.001° |
Cell volume | 1337.82 ± 0.09 Å3 |
Cell temperature | 100 ± 2 K |
Ambient diffraction temperature | 100 ± 2 K |
Number of distinct elements | 5 |
Space group number | 2 |
Hermann-Mauguin space group symbol | P -1 |
Hall space group symbol | -P 1 |
Residual factor for all reflections | 0.0488 |
Residual factor for significantly intense reflections | 0.0423 |
Weighted residual factors for significantly intense reflections | 0.1151 |
Weighted residual factors for all reflections included in the refinement | 0.119 |
Goodness-of-fit parameter for all reflections included in the refinement | 1.047 |
Diffraction radiation wavelength | 1.54178 Å |
Diffraction radiation type | CuKα |