Information card for entry 7159830
Formula | C27 H27 N O4 S2 |
Calculated formula | C27 H27 N O4 S2 |
Title of publication | Application of the intramolecular Diels-Alder vinylarene (IMDAV) reaction for the synthesis of benzo-, carbocyclo-, thienothiopheneisoindolecarboxylic acids and its limitations. |
Authors of publication | Yakovleva, Elizaveta D.; Shelukho, Evgeniya R.; Nadirova, Maryana A.; Erokhin, Pavel P.; Simakova, Daria N.; Khrustalev, Victor N.; Grigoriev, Mikhail S.; Novikov, Anton P.; Romanycheva, Anna A.; Shetnev, Anton A.; Bychkova, Olga P.; Trenin, Alexey S.; Zubkov, Fedor I.; Zaytsev, Vladimir P. |
Journal of publication | Organic & biomolecular chemistry |
Year of publication | 2024 |
Journal volume | 22 |
Journal issue | 13 |
Pages of publication | 2643 - 2653 |
a | 9.65056 ± 0.00014 Å |
b | 11.27375 ± 0.00016 Å |
c | 12.80694 ± 0.00018 Å |
α | 101.984 ± 0.0012° |
β | 108.181 ± 0.0013° |
γ | 109.807 ± 0.0013° |
Cell volume | 1166.44 ± 0.04 Å3 |
Cell temperature | 100 ± 2 K |
Ambient diffraction temperature | 100 ± 2 K |
Number of distinct elements | 5 |
Space group number | 2 |
Hermann-Mauguin space group symbol | P -1 |
Hall space group symbol | -P 1 |
Residual factor for all reflections | 0.0359 |
Residual factor for significantly intense reflections | 0.0347 |
Weighted residual factors for significantly intense reflections | 0.0915 |
Weighted residual factors for all reflections included in the refinement | 0.0925 |
Goodness-of-fit parameter for all reflections included in the refinement | 1.078 |
Diffraction radiation wavelength | 1.54184 Å |
Diffraction radiation type | CuKα |