Information card for entry 7159916
Formula | C52 H48 B Cu F4 P4 |
Calculated formula | C52 H48 B Cu F4 P4 |
SMILES | [Cu]12([P](CC[P]1(c1ccccc1)c1ccccc1)(c1ccccc1)c1ccccc1)[P](CC[P]2(c1ccccc1)c1ccccc1)(c1ccccc1)c1ccccc1.[B](F)(F)(F)[F-] |
Title of publication | Amine adducts of triallylborane as highly reactive allylborating agents for Cu(I)-catalyzed allylation of chiral sulfinylimines. |
Authors of publication | Alexeev, Michael S.; Strelkova, Tatiana V.; Ilyin, Michael M.; Nelyubina, Yulia V.; Bespalov, Ivan A.; Medvedev, Michael G.; Khrustalev, Victor N.; Kuznetsov, Nikolai Yu |
Journal of publication | Organic & biomolecular chemistry |
Year of publication | 2024 |
Journal volume | 22 |
Journal issue | 23 |
Pages of publication | 4680 - 4696 |
a | 14.0344 ± 0.0003 Å |
b | 18.8088 ± 0.0003 Å |
c | 18.9839 ± 0.0004 Å |
α | 90° |
β | 90.5447 ± 0.0019° |
γ | 90° |
Cell volume | 5010.96 ± 0.17 Å3 |
Cell temperature | 100 ± 2 K |
Ambient diffraction temperature | 100 ± 2 K |
Number of distinct elements | 6 |
Space group number | 14 |
Hermann-Mauguin space group symbol | P 1 21/n 1 |
Hall space group symbol | -P 2yn |
Residual factor for all reflections | 0.1466 |
Residual factor for significantly intense reflections | 0.1164 |
Weighted residual factors for significantly intense reflections | 0.2282 |
Weighted residual factors for all reflections included in the refinement | 0.247 |
Goodness-of-fit parameter for all reflections included in the refinement | 1.031 |
Diffraction radiation wavelength | 1.54184 Å |
Diffraction radiation type | CuKα |