Information card for entry 7201566
Formula | C30 H24 O7 Zn |
Calculated formula | C30 H24 O7 Zn |
Title of publication | Zinc(ii) coordination architectures with two bulky anthracene-based carboxylic ligands: crystal structures and luminescent properties |
Authors of publication | Wang, Jun-Jie; Liu, Chun-Sen; Hu, Tong-Liang; Chang, Ze; Li, Cai-Yun; Yan, Li-Fen; Chen, Pei-Quan; Bu, Xian-He; Wu, Qiang; Zhao, Li-Juan; Wang, Zhe; Zhang, Xin-Zheng |
Journal of publication | CrystEngComm |
Year of publication | 2008 |
Journal volume | 10 |
Journal issue | 6 |
Pages of publication | 681 |
a | 13.9951 ± 0.0002 Å |
b | 7.7039 ± 0.0001 Å |
c | 23.5124 ± 0.0003 Å |
α | 90° |
β | 95.787 ± 0.001° |
γ | 90° |
Cell volume | 2522.11 ± 0.06 Å3 |
Cell temperature | 273 ± 2 K |
Ambient diffraction temperature | 273 ± 2 K |
Number of distinct elements | 4 |
Space group number | 14 |
Hermann-Mauguin space group symbol | P 1 21/c 1 |
Hall space group symbol | -P 2ybc |
Residual factor for all reflections | 0.0523 |
Residual factor for significantly intense reflections | 0.0317 |
Weighted residual factors for significantly intense reflections | 0.0776 |
Weighted residual factors for all reflections included in the refinement | 0.0828 |
Goodness-of-fit parameter for all reflections included in the refinement | 1.082 |
Diffraction radiation wavelength | 0.71073 Å |
Diffraction radiation type | MoKα |