Information card for entry 7202003
Formula | C22 H28 Cl2 N6 O13 Zn |
Calculated formula | C22 H28 Cl2 N6 O13 Zn |
SMILES | [Zn]([n]1cc(ccc1)/C=C/c1ccncn1)([n]1cc(ccc1)/C=C/c1ccncn1)([OH2])([OH2])([OH2])[OH2].O.Cl(=O)(=O)(=O)[O-].Cl(=O)(=O)(=O)[O-] |
Title of publication | Supramolecular architectures based on transition metal complexes with 1-(3-pyridyl)-2-(4′-pyrimidyl)ethene |
Authors of publication | Liu, Na; Wang, Yan-Qin; Gao, En-Qing; Chen, Zhen-Xia; Weng, Lin-Hong |
Journal of publication | CrystEngComm |
Year of publication | 2008 |
Journal volume | 10 |
Journal issue | 7 |
Pages of publication | 915 |
a | 7.9922 ± 0.0008 Å |
b | 14.0221 ± 0.0013 Å |
c | 14.1085 ± 0.0014 Å |
α | 102.51 ± 0.001° |
β | 94.572 ± 0.001° |
γ | 103.034 ± 0.001° |
Cell volume | 1490 ± 0.3 Å3 |
Cell temperature | 293 ± 2 K |
Ambient diffraction temperature | 293 ± 2 K |
Number of distinct elements | 6 |
Space group number | 2 |
Hermann-Mauguin space group symbol | P -1 |
Hall space group symbol | -P 1 |
Residual factor for all reflections | 0.0674 |
Residual factor for significantly intense reflections | 0.0577 |
Weighted residual factors for significantly intense reflections | 0.169 |
Weighted residual factors for all reflections included in the refinement | 0.1794 |
Goodness-of-fit parameter for all reflections included in the refinement | 0.997 |
Diffraction radiation wavelength | 0.71073 Å |
Diffraction radiation type | MoKα |