Information card for entry 7202643
Common name | Compound ys16401d |
Formula | C24 H64 Ag3 Mn Mo6 N2 O32 S8 |
Calculated formula | C24 H64 Ag3 Mn Mo6 N2 O32 S8 |
Title of publication | From polyoxometalate building blocks to polymers and materials: the silver connection |
Authors of publication | Song, Yu-Fei; Abbas, Hamera; Ritchie, Chris; McMillian, Nicola; Long, De-Liang; Gadegaard, Nikolaj; Cronin, Leroy |
Journal of publication | Journal of Materials Chemistry |
Year of publication | 2007 |
Journal volume | 17 |
Journal issue | 19 |
Pages of publication | 1903 |
a | 11.9401 ± 0.0003 Å |
b | 38.3746 ± 0.001 Å |
c | 12.8124 ± 0.0003 Å |
α | 90° |
β | 94.095 ± 0.002° |
γ | 90° |
Cell volume | 5855.6 ± 0.3 Å3 |
Cell temperature | 120 ± 2 K |
Ambient diffraction temperature | 120 ± 2 K |
Number of distinct elements | 8 |
Space group number | 14 |
Hermann-Mauguin space group symbol | P 1 21/n 1 |
Hall space group symbol | -P 2yn |
Residual factor for all reflections | 0.0759 |
Residual factor for significantly intense reflections | 0.0444 |
Weighted residual factors for significantly intense reflections | 0.0843 |
Weighted residual factors for all reflections included in the refinement | 0.0948 |
Goodness-of-fit parameter for all reflections included in the refinement | 1.029 |
Diffraction radiation wavelength | 0.71073 Å |
Diffraction radiation type | MoKα |