Information card for entry 7202824
Common name | tris(2,2'-bipyridine-3,3-diol-H)cobalt(iii) hydrate |
Formula | C30 H23 Co N6 O7 |
Calculated formula | C30 H22.98 Co N6 O6.99 |
Title of publication | Network structures with 2,2?-bipyridine-3,3?diol: a discrete Co(III) complex that forms a porous 3-D hydrogen bonded network, and Cu(ii) coordination chains |
Authors of publication | Stephenson, Maria D.; Hardie, Michaele J. |
Journal of publication | CrystEngComm |
Year of publication | 2007 |
Journal volume | 9 |
Journal issue | 6 |
Pages of publication | 496 |
a | 14.2158 ± 0.0004 Å |
b | 14.2158 ± 0.0004 Å |
c | 9.4244 ± 0.0002 Å |
α | 90° |
β | 90° |
γ | 120° |
Cell volume | 1649.4 ± 0.07 Å3 |
Cell temperature | 150 ± 2 K |
Ambient diffraction temperature | 150 ± 2 K |
Number of distinct elements | 5 |
Space group number | 163 |
Hermann-Mauguin space group symbol | P -3 1 c |
Hall space group symbol | -P 3 2c |
Residual factor for all reflections | 0.06 |
Residual factor for significantly intense reflections | 0.0575 |
Weighted residual factors for significantly intense reflections | 0.2134 |
Weighted residual factors for all reflections included in the refinement | 0.2173 |
Goodness-of-fit parameter for all reflections included in the refinement | 1.257 |
Diffraction radiation wavelength | 0.71073 Å |
Diffraction radiation type | MoKα |