Information card for entry 7202865
Formula | C30 H26 N2 O11 Zn2 |
Calculated formula | C30 H26 N2 O11 Zn2 |
Title of publication | Structural diversity and properties of M(ii) 4-carboxyl phenoxyacetate complexes with 0D-, 1D-, 2D- and 3D M-cpoa framework |
Authors of publication | Zhuang, Wenjuan; Zheng, Xiangjun; Li, Licun; Liao, Daizheng; Ma, Hui; Jin, Linpei |
Journal of publication | CrystEngComm |
Year of publication | 2007 |
Journal volume | 9 |
Journal issue | 8 |
Pages of publication | 653 |
a | 8.116 ± 0.002 Å |
b | 12.279 ± 0.003 Å |
c | 16.009 ± 0.004 Å |
α | 69.271 ± 0.004° |
β | 86.078 ± 0.004° |
γ | 79.166 ± 0.004° |
Cell volume | 1465.5 ± 0.6 Å3 |
Cell temperature | 294 ± 2 K |
Ambient diffraction temperature | 294 ± 2 K |
Number of distinct elements | 5 |
Space group number | 2 |
Hermann-Mauguin space group symbol | P -1 |
Hall space group symbol | -P 1 |
Residual factor for all reflections | 0.1307 |
Residual factor for significantly intense reflections | 0.0533 |
Weighted residual factors for significantly intense reflections | 0.0911 |
Weighted residual factors for all reflections included in the refinement | 0.1223 |
Goodness-of-fit parameter for all reflections included in the refinement | 1.031 |
Diffraction radiation wavelength | 0.71073 Å |
Diffraction radiation type | MoKα |