Information card for entry 7202871
Common name | (NH3(CH2)4NH3)La(hedpH)(hedpH2) |
Formula | C8 H25 La N2 O14 P4 |
Calculated formula | C8 H25 La N2 O14 P4 |
Title of publication | Crystal structure and photoluminescence properties of lanthanide diphosphonates |
Authors of publication | Liu, Feng-Yi; Roces, Laura; Sa Ferreira, Rute A.; García-Granda, Santiago; García, José R.; Carlos, Luis D.; Rocha, João |
Journal of publication | Journal of Materials Chemistry |
Year of publication | 2007 |
Journal volume | 17 |
Journal issue | 35 |
Pages of publication | 3696 |
a | 10.215 ± 0.001 Å |
b | 10.697 ± 0.001 Å |
c | 10.722 ± 0.001 Å |
α | 67.49 ± 0.01° |
β | 89.98 ± 0.01° |
γ | 68.65 ± 0.01° |
Cell volume | 994.8 ± 0.2 Å3 |
Cell temperature | 293 ± 2 K |
Ambient diffraction temperature | 293 ± 2 K |
Number of distinct elements | 6 |
Space group number | 2 |
Hermann-Mauguin space group symbol | P -1 |
Hall space group symbol | -P 1 |
Residual factor for all reflections | 0.0501 |
Residual factor for significantly intense reflections | 0.0498 |
Weighted residual factors for significantly intense reflections | 0.1358 |
Weighted residual factors for all reflections included in the refinement | 0.1363 |
Goodness-of-fit parameter for all reflections included in the refinement | 1.068 |
Diffraction radiation probe | x-ray |
Diffraction radiation wavelength | 1.54184 Å |
Diffraction radiation type | CuKα |