Information card for entry 7202879
Formula | C32 H8 Cu6.94 N32 O4 W4 |
Calculated formula | C16 Cu3.468 N16 O2 W2 |
Title of publication | Exploring the formation of 3D ferromagnetic cyano-bridged CuII2+x{CuII4[WV(CN)8]4‒2x[WIV(CN)8]2x}·yH2O networks |
Authors of publication | Podgajny, Robert; Chmel, Nikola Paul; Bałanda, Maria; Tracz, Piotr; Gaweł, Bartłomiej; Zając, Dariusz; Sikora, Marcin; Kapusta, Czesław; Łasocha, Wiesław; Wasiutyński, Tadeusz; Sieklucka, Barbara |
Journal of publication | Journal of Materials Chemistry |
Year of publication | 2007 |
Journal volume | 17 |
Journal issue | 31 |
Pages of publication | 3308 |
a | 7.2858 ± 0.0009 Å |
b | 7.2858 ± 0.0009 Å |
c | 28.282 ± 0.005 Å |
α | 90° |
β | 90° |
γ | 90° |
Cell volume | 1501.3 ± 0.4 Å3 |
Ambient diffraction temperature | 273 K |
Number of distinct elements | 6 |
Space group number | 139 |
Hermann-Mauguin space group symbol | I 4/m m m |
Hall space group symbol | -I 4 2 |
Residual factor for all reflections | 0.0525 |
Residual factor for significantly intense reflections | 0.0525 |
Weighted residual factors for significantly intense reflections | 0.0436 |
Weighted residual factors for all reflections included in the refinement | 0.0436 |
Method of determination | powder diffraction |
Diffraction radiation probe | x-ray |
Diffraction radiation wavelength | 1.54178 Å |
Diffraction radiation type | CuKα |