Information card for entry 7202882
Formula | C42 H52 Cl2 Cu2 N10 O14 |
Calculated formula | C42 H52 Cl2 Cu2 N10 O14 |
Title of publication | Magnetic properties tuned by oxamido bridging ligand derivatives in two new hybrid organic inorganic nitronyl nitroxide copper(ii) complexes |
Authors of publication | Zhang, Jian-Ying; Liu, Cai-Ming; Zhang, De-Qing; Gao, Song; Zhu, Dao-Ben |
Journal of publication | CrystEngComm |
Year of publication | 2007 |
Journal volume | 9 |
Journal issue | 9 |
Pages of publication | 799 |
a | 16.254 ± 0.003 Å |
b | 13.211 ± 0.003 Å |
c | 11.776 ± 0.002 Å |
α | 90° |
β | 108.4 ± 0.03° |
γ | 90° |
Cell volume | 2399.4 ± 0.9 Å3 |
Cell temperature | 293 ± 2 K |
Ambient diffraction temperature | 293 ± 2 K |
Number of distinct elements | 6 |
Space group number | 14 |
Hermann-Mauguin space group symbol | P 1 21/c 1 |
Hall space group symbol | -P 2ybc |
Residual factor for all reflections | 0.0924 |
Residual factor for significantly intense reflections | 0.0615 |
Weighted residual factors for significantly intense reflections | 0.1604 |
Weighted residual factors for all reflections included in the refinement | 0.1805 |
Goodness-of-fit parameter for all reflections included in the refinement | 1.032 |
Diffraction radiation wavelength | 0.71073 Å |
Diffraction radiation type | MoKα |