Information card for entry 7203314
Formula | C37 H42 Cr Mn2 N13 O8 S |
Calculated formula | C37 H42 Cr Mn2 N13 O8 S |
Title of publication | Trinuclear magnetic clusters based on cyanide metal complexes: synthesis, crystal structures, and magnetic properties of four new [Mn<small><sup>II</sup></small><small><sub>2</sub></small>M<small><sup>III</sup></small>] complexes (M = Cr, Fe, Co) |
Authors of publication | Carmen Paraschiv; Marius Andruh; Yves Journaux; Zdirad Žak; Nathalie Kyritsakas; Louis Ricard |
Journal of publication | Journal of Materials Chemistry |
Year of publication | 2006 |
Journal volume | 16 |
Journal issue | 26 |
Pages of publication | 2660 |
a | 9.7483 ± 0.0002 Å |
b | 11.5277 ± 0.0003 Å |
c | 11.6016 ± 0.0003 Å |
α | 68.5041 ± 0.0011° |
β | 86.9896 ± 0.0011° |
γ | 78.3951 ± 0.0012° |
Cell volume | 1187.93 ± 0.05 Å3 |
Cell temperature | 173 ± 2 K |
Ambient diffraction temperature | 173 ± 2 K |
Number of distinct elements | 7 |
Space group number | 2 |
Hermann-Mauguin space group symbol | P -1 |
Hall space group symbol | -P 1 |
Residual factor for all reflections | 0.0687 |
Residual factor for significantly intense reflections | 0.056 |
Weighted residual factors for significantly intense reflections | 0.1778 |
Weighted residual factors for all reflections included in the refinement | 0.191 |
Goodness-of-fit parameter for all reflections included in the refinement | 1.168 |
Diffraction radiation wavelength | 0.71073 Å |
Diffraction radiation type | MoKα |