Information card for entry 7203331
Formula | C102 H134 Mn9 N72 O58 |
Calculated formula | C102 H78 Mn9 N72 O58 |
Title of publication | Self-assembled polymetallic square grids ([2 ? 2] M4, [3 ? 3] M9) and trigonal bipyramidal clusters (M5)?structural and magnetic properties |
Authors of publication | Dawe, Louise N.; Abedin, Tareque S. M.; Kelly, Timothy L.; Thompson, Laurence K.; Miller, David O.; Zhao, Liang; Wilson, Claire; Leech, Michael A.; Howard, Judith A. K. |
Journal of publication | Journal of Materials Chemistry |
Year of publication | 2006 |
Journal volume | 16 |
Journal issue | 26 |
Pages of publication | 2645 |
a | 27.9255 ± 0.0013 Å |
b | 27.9255 ± 0.0013 Å |
c | 40.217 ± 0.002 Å |
α | 90° |
β | 90° |
γ | 90° |
Cell volume | 31363 ± 3 Å3 |
Cell temperature | 153 ± 2 K |
Ambient diffraction temperature | 153 ± 2 K |
Number of distinct elements | 5 |
Space group number | 142 |
Hermann-Mauguin space group symbol | I 41/a c d :2 |
Hall space group symbol | -I 4bd 2c |
Residual factor for all reflections | 0.1356 |
Residual factor for significantly intense reflections | 0.1278 |
Weighted residual factors for significantly intense reflections | 0.3008 |
Weighted residual factors for all reflections included in the refinement | 0.3049 |
Goodness-of-fit parameter for all reflections included in the refinement | 1.348 |
Diffraction radiation wavelength | 0.7107 Å |
Diffraction radiation type | MoKα |