Information card for entry 7203337
Formula | C66 H132 Fe7 N3 O33 |
Calculated formula | C66 H123 Fe7 N3 O33 |
Title of publication | Heptanuclear iron(iii) triethanolamine clusters exhibiting ?millennium dome?-like topologies and an octanuclear analogue with ground spin states of S = 5/2 and 0, respectively |
Authors of publication | Jones, Leigh F.; Jensen, Paul; Moubaraki, Boujemaa; Berry, Kevin J.; Boas, John F.; Pilbrow, John R.; Murray, Keith S. |
Journal of publication | Journal of Materials Chemistry |
Year of publication | 2006 |
Journal volume | 16 |
Journal issue | 26 |
Pages of publication | 2690 |
a | 15.7648 ± 0.0002 Å |
b | 15.7648 ± 0.0002 Å |
c | 21.1873 ± 0.0005 Å |
α | 90° |
β | 90° |
γ | 120° |
Cell volume | 4560.19 ± 0.14 Å3 |
Cell temperature | 123 ± 2 K |
Ambient diffraction temperature | 123 ± 2 K |
Number of distinct elements | 5 |
Space group number | 159 |
Hermann-Mauguin space group symbol | P 3 1 c |
Hall space group symbol | P 3 -2c |
Residual factor for all reflections | 0.093 |
Residual factor for significantly intense reflections | 0.0568 |
Weighted residual factors for significantly intense reflections | 0.1179 |
Weighted residual factors for all reflections included in the refinement | 0.1319 |
Goodness-of-fit parameter for all reflections included in the refinement | 1.026 |
Diffraction radiation wavelength | 0.71073 Å |
Diffraction radiation type | MoKα |