Information card for entry 7203353
Formula | C68 H52 Fe N26 O2 S2 |
Calculated formula | C68 H48 Fe N26 O2 S2 |
Title of publication | Spin transition in a triazine-based Fe(<small>II</small>) complex: variable-temperature structural, thermal, magnetic and spectroscopic studies |
Authors of publication | Manuel Quesada; Maria Monrabal; Guillem Aromí; Víctor A. de la Peña-O'Shea; Martí Gich; Elies Molins; Olivier Roubeau; Simon J. Teat; Elizabeth J. MacLean; Patrick Gamez; Jan Reedijk |
Journal of publication | Journal of Materials Chemistry |
Year of publication | 2006 |
Journal volume | 16 |
Journal issue | 26 |
Pages of publication | 2669 |
a | 11.7103 ± 0.0005 Å |
b | 12.8096 ± 0.0006 Å |
c | 12.9408 ± 0.0006 Å |
α | 95.223 ± 0.002° |
β | 111.65 ± 0.002° |
γ | 116.42 ± 0.002° |
Cell volume | 1537.99 ± 0.13 Å3 |
Cell temperature | 150 ± 2 K |
Ambient diffraction temperature | 150 ± 2 K |
Number of distinct elements | 6 |
Space group number | 2 |
Hermann-Mauguin space group symbol | P -1 |
Hall space group symbol | -P 1 |
Residual factor for all reflections | 0.0516 |
Residual factor for significantly intense reflections | 0.0434 |
Weighted residual factors for significantly intense reflections | 0.1164 |
Weighted residual factors for all reflections included in the refinement | 0.1206 |
Goodness-of-fit parameter for all reflections included in the refinement | 1.09 |
Diffraction radiation wavelength | 0.6923 Å |
Diffraction radiation type | synchrotron |