Information card for entry 7203382
Formula |
C20 H15 F N Ni S6 |
Calculated formula |
C20 H15 F N Ni S6 |
Title of publication |
Magnetic properties of RBzPy[Ni(?-tpdt)2] (R = H, Br, F): effects of cis?trans disorder |
Authors of publication |
Belo, D.; Figueira, M. J.; Nunes, J. P. M.; Santos, I. C.; Pereira, L. C.; Gama, V.; Almeida, M.; Rovira, C. |
Journal of publication |
Journal of Materials Chemistry |
Year of publication |
2006 |
Journal volume |
16 |
Journal issue |
26 |
Pages of publication |
2746 |
a |
10.428 ± 0.0012 Å |
b |
12.394 ± 0.0006 Å |
c |
16.594 ± 0.0019 Å |
α |
90° |
β |
90° |
γ |
90° |
Cell volume |
2144.7 ± 0.4 Å3 |
Cell temperature |
110 ± 2 K |
Ambient diffraction temperature |
110 ± 2 K |
Number of distinct elements |
6 |
Space group number |
19 |
Hermann-Mauguin space group symbol |
P 21 21 21 |
Hall space group symbol |
P 2ac 2ab |
Residual factor for all reflections |
0.0858 |
Residual factor for significantly intense reflections |
0.0584 |
Weighted residual factors for significantly intense reflections |
0.1303 |
Weighted residual factors for all reflections included in the refinement |
0.1402 |
Goodness-of-fit parameter for all reflections included in the refinement |
0.99 |
Diffraction radiation wavelength |
0.71073 Å |
Diffraction radiation type |
MoKα |
Yes |
Yes |
No |