Information card for entry 7203415
Formula | C54 H75.9 Mn4 N4.7 O20.3 |
Calculated formula | C54 H75.3 Mn4 N4.7 O20.3 |
Title of publication | Enhancing single molecule magnet parameters. Synthesis, crystal structures and magnetic properties of mixed-valent Mn<small><sub>4</sub></small> SMMs |
Authors of publication | Ayuk M. Ako; Valeriu Mereacre; Ian J. Hewitt; Rodolphe Clérac; Lollita Lecren; Christopher E. Anson; Annie K. Powell |
Journal of publication | Journal of Materials Chemistry |
Year of publication | 2006 |
Journal volume | 16 |
Journal issue | 26 |
Pages of publication | 2579 |
a | 30.242 ± 0.003 Å |
b | 8.671 ± 0.0006 Å |
c | 26.618 ± 0.003 Å |
α | 90° |
β | 119.915 ± 0.009° |
γ | 90° |
Cell volume | 6050 ± 1.1 Å3 |
Cell temperature | 150 ± 2 K |
Ambient diffraction temperature | 150 ± 2 K |
Number of distinct elements | 5 |
Space group number | 15 |
Hermann-Mauguin space group symbol | C 1 2/c 1 |
Hall space group symbol | -C 2yc |
Residual factor for all reflections | 0.1091 |
Residual factor for significantly intense reflections | 0.0904 |
Weighted residual factors for significantly intense reflections | 0.2279 |
Weighted residual factors for all reflections included in the refinement | 0.2397 |
Goodness-of-fit parameter for all reflections included in the refinement | 1.091 |
Diffraction radiation wavelength | 0.71073 Å |
Diffraction radiation type | MoKα |