Information card for entry 7203469
Common name | (S-(beta)-phenethylammonium)trichloroplumbate(ii) |
Chemical name | (S-(β)-phenethylammonium)trichloroplumbate(II) |
Formula | C8 H12 Cl3 N Pb |
Calculated formula | C8 H12 Cl3 N Pb |
Title of publication | Synthesis and crystal structures of inorganic?organic hybrids incorporating an aromatic amine with a chiral functional group |
Authors of publication | Billing, David G.; Lemmerer, Andreas |
Journal of publication | CrystEngComm |
Year of publication | 2006 |
Journal volume | 8 |
Journal issue | 9 |
Pages of publication | 686 |
a | 7.6917 ± 0.0015 Å |
b | 7.7273 ± 0.0015 Å |
c | 20.524 ± 0.004 Å |
α | 90° |
β | 90° |
γ | 90° |
Cell volume | 1219.9 ± 0.4 Å3 |
Cell temperature | 293 ± 2 K |
Ambient diffraction temperature | 293 ± 2 K |
Number of distinct elements | 5 |
Space group number | 19 |
Hermann-Mauguin space group symbol | P 21 21 21 |
Hall space group symbol | P 2ac 2ab |
Residual factor for all reflections | 0.0279 |
Residual factor for significantly intense reflections | 0.0254 |
Weighted residual factors for significantly intense reflections | 0.0609 |
Weighted residual factors for all reflections included in the refinement | 0.0619 |
Goodness-of-fit parameter for all reflections included in the refinement | 1.049 |
Diffraction radiation wavelength | 0.71073 Å |
Diffraction radiation type | MoKα |