Information card for entry 7203725
Formula | C47 H37 Cl5 N2 O Os S32 |
Calculated formula | C47 H37 Cl5 N2 O Os S32 |
Title of publication | Variety of molecular conducting layers in the family of radical cation salts based on BEDT-TTF with the metal mononitrosyl complex [OsNOCl5]2‒ |
Authors of publication | Simonov, Sergey V.; Shevyakova, Irina Yu.; Zorina, Leokadiya V.; Khasanov, Salavat S.; Buravov, Lev I.; Emel'yanov, Vyacheslav A.; Canadell, Enric; Shibaeva, Rimma P.; Yagubskii, Eduard B. |
Journal of publication | Journal of Materials Chemistry |
Year of publication | 2005 |
Journal volume | 15 |
Journal issue | 25 |
Pages of publication | 2476 |
a | 8.741 ± 0.0004 Å |
b | 11.9042 ± 0.0006 Å |
c | 17.1842 ± 0.0006 Å |
α | 95.305 ± 0.004° |
β | 92.646 ± 0.003° |
γ | 95.136 ± 0.004° |
Cell volume | 1770.61 ± 0.14 Å3 |
Cell temperature | 295 ± 2 K |
Ambient diffraction temperature | 293 ± 2 K |
Number of distinct elements | 7 |
Space group number | 2 |
Hermann-Mauguin space group symbol | P -1 |
Hall space group symbol | -P 1 |
Residual factor for all reflections | 0.0474 |
Residual factor for significantly intense reflections | 0.0363 |
Weighted residual factors for significantly intense reflections | 0.0793 |
Weighted residual factors for all reflections included in the refinement | 0.0843 |
Goodness-of-fit parameter for all reflections included in the refinement | 1.015 |
Diffraction radiation probe | x-ray |
Diffraction radiation wavelength | 0.71073 Å |
Diffraction radiation type | Mokα |