Information card for entry 7203836
Formula |
Ca Dy Mn O6 Sn |
Calculated formula |
Ca Dy Mn O6 Sn |
Title of publication |
Synthesis and crystal structure of novel CaRMnSnO6(R = La, Pr, Nd, Sm‒Dy) double perovskites |
Authors of publication |
Abakumov, Artem M.; Rossell, Marta D.; Seryakov, Sergey A.; Rozova, Marina G.; Markina, Maria M.; Van Tendeloo, Gustaaf; Antipov, Evgeny V. |
Journal of publication |
Journal of Materials Chemistry |
Year of publication |
2005 |
Journal volume |
15 |
Journal issue |
46 |
Pages of publication |
4899 |
a |
5.6928 Å |
b |
7.733 Å |
c |
5.4179 Å |
α |
90° |
β |
90° |
γ |
90° |
Cell volume |
238.509 Å3 |
Number of distinct elements |
5 |
Space group number |
62 |
Hermann-Mauguin space group symbol |
P n m a |
Hall space group symbol |
-P 2ac 2n |
Residual factor for all reflections |
0.0415 |
Residual factor for significantly intense reflections |
0.0334 |
Weighted residual factors for significantly intense reflections |
0.0171 |
Weighted residual factors for all reflections included in the refinement |
0.0175 |
Method of determination |
powder diffraction |
Diffraction radiation wavelength |
1.5406 Å |
Diffraction radiation type |
X-ray |
Yes |
No |
No |