Information card for entry 7204161
Formula | C30 H30 Br2 Cu4 Mo N6 S4 |
Calculated formula | C30 H30 Br2 Cu4 Mo N6 S4 |
Title of publication | Study on a series of pentanuclear planar 'open' clusters: synthesis, characterization, strong third-order optical nonlinearities and superior optical limiting properties |
Authors of publication | Zhang, Chi; Song, Yinglin; Kühn, Fritz E.; Wang, Yuxiao; Fun, Hoongkun; Xin, Xinquan |
Journal of publication | Journal of Materials Chemistry |
Year of publication | 2002 |
Journal volume | 12 |
Journal issue | 2 |
Pages of publication | 239 |
a | 22.5496 ± 0.0001 Å |
b | 22.7445 ± 0.0003 Å |
c | 30.2498 ± 0.0004 Å |
α | 90° |
β | 90° |
γ | 90° |
Cell volume | 15514.5 ± 0.3 Å3 |
Cell temperature | 293 ± 2 K |
Ambient diffraction temperature | 293 ± 2 K |
Number of distinct elements | 7 |
Space group number | 43 |
Hermann-Mauguin space group symbol | F d d 2 |
Hall space group symbol | F 2 -2d |
Residual factor for all reflections | 0.0827 |
Residual factor for significantly intense reflections | 0.0479 |
Weighted residual factors for significantly intense reflections | 0.0966 |
Weighted residual factors for all reflections included in the refinement | 0.1099 |
Goodness-of-fit parameter for all reflections included in the refinement | 1.042 |
Diffraction radiation wavelength | 0.71073 Å |
Diffraction radiation type | MoKα |