Information card for entry 7204206
Formula | C16 H38 Al10 F2 N4 O40 P10 |
Calculated formula | C16 H38 Al10 F2 N4 O40 P10 |
Title of publication | Synthesis of two new aluminophosphate based layered materials using Tet-A as a structure-directing agent |
Authors of publication | Wheatley, Paul S.; Love, Christopher J.; Morrison, John J.; Shannon, Ian J.; Morris, Russell E. |
Journal of publication | Journal of Materials Chemistry |
Year of publication | 2002 |
Journal volume | 12 |
Journal issue | 3 |
Pages of publication | 477 |
a | 16.8349 ± 0.0003 Å |
b | 9.6773 ± 0.0002 Å |
c | 32.7691 ± 0.0006 Å |
α | 90° |
β | 90° |
γ | 90° |
Cell volume | 5338.62 ± 0.18 Å3 |
Cell temperature | 150 ± 2 K |
Ambient diffraction temperature | 150 ± 2 K |
Number of distinct elements | 7 |
Space group number | 29 |
Hermann-Mauguin space group symbol | P c a 21 |
Hall space group symbol | P 2c -2ac |
Residual factor for all reflections | 0.1262 |
Residual factor for significantly intense reflections | 0.1035 |
Weighted residual factors for significantly intense reflections | 0.2858 |
Weighted residual factors for all reflections included in the refinement | 0.2959 |
Goodness-of-fit parameter for all reflections included in the refinement | 1.029 |
Diffraction radiation wavelength | 0.6887 Å |
Diffraction radiation type | MonochromatedX-raysynchrotronradiation |