Information card for entry 7204223
Formula | C H5 Be Co0.17 N0.67 O4.5 P |
Calculated formula | Be Co0.166667 N0.66 O4.5 P |
Title of publication | [C6N4H24]CoBe6P6O24·3H2O: a novel 3-dimensional beryllophosphate zeolite-like structure encapsulating CoII ions |
Authors of publication | Zhang, Haoyu; Weng, Linhong; Zhou, Yaming; Chen, Zhenxia; Sun, Jinyu; Zhao, Dongyuan |
Journal of publication | Journal of Materials Chemistry |
Year of publication | 2002 |
Journal volume | 12 |
Journal issue | 3 |
Pages of publication | 658 |
a | 12.38 ± 0.003 Å |
b | 12.38 ± 0.003 Å |
c | 14.558 ± 0.005 Å |
α | 90° |
β | 90° |
γ | 120° |
Cell volume | 1932.3 ± 0.9 Å3 |
Cell temperature | 298 ± 2 K |
Ambient diffraction temperature | 298 ± 2 K |
Number of distinct elements | 7 |
Space group number | 148 |
Hermann-Mauguin space group symbol | R -3 :H |
Hall space group symbol | -R 3 |
Residual factor for all reflections | 0.0881 |
Residual factor for significantly intense reflections | 0.0878 |
Weighted residual factors for significantly intense reflections | 0.1929 |
Weighted residual factors for all reflections included in the refinement | 0.1931 |
Goodness-of-fit parameter for all reflections included in the refinement | 1.472 |
Diffraction radiation wavelength | 0.71073 Å |
Diffraction radiation type | MoKα |