Information card for entry 7204259
Formula | C H2 Na O8.5 P2 Zn2 |
Calculated formula | C H2 Na O8.5 P2 Zn2 |
Title of publication | Microporous hybrid compounds: hydrothermal synthesis and characterization of two zinciomethylenediphosphonates with 3D structures, structure determination of their dehydrated formsElectronic supplementary information (ESI): final Rietveld plots for MIL-48calc and VSB-4(Zn). See http://www.rsc.org/suppdata/jm/b1/b108301p |
Authors of publication | Barthelet, K.; Merlier, C.; Serre, C.; Riou-Cavellec, M.; Riou, D.; Férey, G. |
Journal of publication | Journal of Materials Chemistry |
Year of publication | 2002 |
Journal volume | 12 |
Journal issue | 4 |
Pages of publication | 1132 |
a | 8.9929 ± 0.0009 Å |
b | 5.5093 ± 0.0006 Å |
c | 18.025 ± 0.002 Å |
α | 90° |
β | 92.376 ± 0.002° |
γ | 90° |
Cell volume | 892.27 ± 0.16 Å3 |
Cell temperature | 293 ± 2 K |
Ambient diffraction temperature | 293 ± 2 K |
Number of distinct elements | 6 |
Space group number | 14 |
Hermann-Mauguin space group symbol | P 1 21/c 1 |
Hall space group symbol | -P 2ybc |
Residual factor for all reflections | 0.162 |
Residual factor for significantly intense reflections | 0.07 |
Weighted residual factors for all reflections | 0.1379 |
Weighted residual factors for significantly intense reflections | 0.1078 |
Goodness-of-fit parameter for all reflections | 1.057 |
Goodness-of-fit parameter for significantly intense reflections | 1.145 |
Diffraction radiation wavelength | 0.71073 Å |
Diffraction radiation type | MoKα |