Information card for entry 7204387
Formula |
C54 H29 As2 Cl F12 N8 O4 S16 |
Calculated formula |
C54 H29 As2 Cl F12 N8 O4 S16 |
Title of publication |
Structural phase transition in quasi-one-dimensional conductors (BDTFP)2X(PhCl)0.5 (X = PF6 and AsF6) [BDTFP = 5,7-bis(1,3-dithiol-2-ylidene)-5,7-dihydrofuro[3,4-b]pyrazine; PhCl = chlorobenzene] |
Authors of publication |
Uruichi, M.; Yakushi, K.; Shirahata, T.; Takahashi, K.; Mori, T.; Nakamura, T. |
Journal of publication |
Journal of Materials Chemistry |
Year of publication |
2002 |
Journal volume |
12 |
Journal issue |
9 |
Pages of publication |
2696 |
a |
15.252 ± 0.004 Å |
b |
16.083 ± 0.005 Å |
c |
6.8902 ± 0.0009 Å |
α |
100.22 ± 0.02° |
β |
98.09 ± 0.02° |
γ |
100.55 ± 0.02° |
Cell volume |
1608.8 ± 0.7 Å3 |
Cell temperature |
100 K |
Number of distinct elements |
8 |
Space group number |
2 |
Hermann-Mauguin space group symbol |
P -1 |
Hall space group symbol |
-P 1 |
Residual factor for significantly intense reflections |
0.0648 |
Weighted residual factors for all reflections included in the refinement |
0.087 |
Goodness-of-fit parameter for all reflections included in the refinement |
1.725 |
Diffraction radiation wavelength |
0.7107 Å |
Diffraction radiation type |
MoKα |
Yes |
No |
No |