Information card for entry 7204734
Chemical name | N-[(Isopropylthio)thioxomethyl] Alanine |
Formula | C7 H13 N O2 S2 |
Calculated formula | C7 H13 N O2 S2 |
SMILES | S=C(SC(C)C)NC(C(=O)O)C |
Title of publication | Competitive N?H?O?C and N?H?S?C hydrogen bonding in alanine dithiocarbamates |
Authors of publication | Wheeler, Kraig A.; Harrington, Beverly; Zapp, Matthew; Casey, Endia |
Journal of publication | CrystEngComm |
Year of publication | 2003 |
Journal volume | 5 |
Journal issue | 59 |
Pages of publication | 337 |
a | 13.198 ± 0.004 Å |
b | 7.613 ± 0.002 Å |
c | 11.927 ± 0.004 Å |
α | 90° |
β | 116.71 ± 0.01° |
γ | 90° |
Cell volume | 1070.5 ± 0.6 Å3 |
Cell temperature | 298 ± 2 K |
Ambient diffraction temperature | 298 ± 2 K |
Number of distinct elements | 5 |
Space group number | 14 |
Hermann-Mauguin space group symbol | P 1 21/c 1 |
Hall space group symbol | -P 2ybc |
Residual factor for all reflections | 0.1638 |
Residual factor for significantly intense reflections | 0.0744 |
Weighted residual factors for significantly intense reflections | 0.1749 |
Weighted residual factors for all reflections included in the refinement | 0.2184 |
Goodness-of-fit parameter for all reflections included in the refinement | 1.01 |
Diffraction radiation wavelength | 0.71073 Å |
Diffraction radiation type | MoKα |